cloth diapers
preferred label: kestovaipat @fi
preferred label: flergångsblöjor @sv
type: Concept
broader: napkins, diapers

napkins, diapers
type: Concept
preferred label: vaipat @fi
preferred label: blöjor @sv
comment: 1) ulosteen ja virtsan keräämistä varten (vauvaikäisillä) lapsilla ja pidätyskyvyttömillä aikuisilla pidetttävä imukykyinen side tai taitos; 2) jotakin peittävä tai ympäröivä kotelo, kerros, suojus tms., erik. a) (geol.) maan sisusta ympäröivä n. 2900 km:n paksuinen aineskehä maan kuoren alla; b) (geom.) lieriötä, kartiota, särmiötä tms. rajoittava pinta (pohjia lukuun ottamatta), vaippapinta
in scheme: conceptscheme
narrower: cloth diapers
broader: concrete inanimate object
source: Suomen kielen perussanakirja

concrete inanimate object
preferred label: konkret icke-levande objekt @sv
preferred label: konkreettinen eloton objekti @fi
type: Concept
narrower: napkins, diapers