konstnärshem
type: Concept
narrower: Ahola
preferred label: artists' homes @en
preferred label: taiteilijakodit @fi

Ahola
type: Concept
broader: konstnärshem
in scheme: conceptscheme
scope note: Kirjailija Juhani Ahon ja taidemaalari Venny Soldan-Brofeldtin taitelijakoti Järvenpäässä