soitinmusiikki
preferred label: instrumental music @en
preferred label: instrumentalmusik @sv
type: Concept
related: sinfoniset runot

sinfoniset runot
preferred label: symfoniska dikter @sv
preferred label: symphonic poems @en
in scheme: conceptscheme
source: Kielitoimiston sanakirja
related: soitinmusiikki
type: Concept
broader: sävellykset
alternative label: sävelrunot
comment: yksiosainen orkesterisävellys, joka pyrkii kuvailemaan jtak kirjallista tm. aihetta, sävelruno

sävellykset
preferred label: compositions @en
preferred label: kompositioner @sv
type: Concept
narrower: sinfoniset runot