esineet
type: Concept

käsityöt
type: Concept
broader generic: esineet
creator: Museoalan asiasanasto
broader: esineet
comment: käsin tai käsin koneella eri materiaaleista valmistetut esineet
in scheme: conceptscheme