MAO-käsite
type: Class
label: MAO-begrepp @sv
label: MAO Concept @en

asumukset (paikat)
type: Concept
type: MAO-käsite
narrower: piilopirtit

piilopirtit
type: MAO-käsite
type: Concept
source: Arkeologisen kulttuuriperinnön opas (2019)
broader: asumukset (paikat)
definition: syrjäinen ja vaikeasti löydettävissä oleva asumus, jota on käytetty piilopaikkana rauhattomina aikoina
in scheme: tao