MAO-käsite
type: Class
label: MAO-begrepp @sv
label: MAO Concept @en

rakennusinventointi
type: MAO-käsite
type: Concept
source: Museoviraston sanastotyö (2019)
broader: kulttuuriympäristöinventointi
definition: yksittäiseen rakennukseen ja sen sisätiloihin, materiaaleihin ja sisustukseen kohdistuva inventointi
in scheme: tao
note: Rakennusinventointi voi olla osa rakennushistoriaselvitystä.

kulttuuriympäristöinventointi
type: MAO-käsite
type: Concept
narrower: rakennusinventointi