MAO-käsite
type: Class
label: MAO-begrepp @sv
label: MAO Concept @en

klubitakit
type: MAO-käsite
type: Concept
date: 20.08.2003
comment: tumma kaksirivinen metallinappinen irtotakki
broader: pikkutakit
in scheme: tao

pikkutakit
type: MAO-käsite
type: Concept
narrower: klubitakit