MAO-käsite
type: Class
label: MAO-begrepp @sv
label: MAO Concept @en

linnoitteiden osat
type: MAO-käsite
type: Concept
narrower: tenaljit

tenaljit
type: MAO-käsite
type: Concept
comment: Hautapihti; varustus, jonka muodostaa kaksi kulmittain sijoitettua muuria. Useista peräkkäisistä tenaljeista muodostuu tenaljijärjestelmä, bastionirintaman vastine. Erityisesti bastionijärjestelmän mukaan rakennetun linnoituksen päähaudassa, vastapäätä kurtiinia, lähinnä sitä sijaitseva matala ulkovarustus, jonka tehtävänä oli suojata tavallisesti kurtiinin keskustaan sijoitettua linnoituksen porttia, supistaa vihollisen sivusta- ja kaaritulen vaikutusta ja tarjota omille hyökkäysjoukoille suojaa.
alternative label: hautapihdit
broader: linnoitteiden osat
in scheme: tao
preferred label: tenaille @en
preferred label: tenalji @sv
preferred label: Теналь (tenal’) @ru