MAO-käsite
type: Class
label: MAO-begrepp @sv
label: MAO Concept @en

lennätinasemat
type: MAO-käsite
type: Concept
narrower: optiset lennätinasemat

optiset lennätinasemat
type: MAO-käsite
type: Concept
source: Arkeologisen kulttuuriperinnön opas (2019)
broader: lennätinasemat
definition: rakennus, josta on välitetty viestejä taulujen ja lippujen avulla
in scheme: tao