MAO-käsite
type: Class
label: MAO-begrepp @sv
label: MAO Concept @en

kylänpaikat
type: MAO-käsite
type: Concept
narrower: autiopyölit

autiopyölit
type: MAO-käsite
type: Concept
source: Arkeologisen kulttuuriperinnön opas (2019)
broader: kylänpaikat
definition: keskiajalla tai uuden ajan alussa autioitunut kylänpaikka
in scheme: tao