MAO-käsite
label: MAO-begrepp @sv
label: MAO Concept @en
type: Class

hautakummut
source: Arkeologisen kulttuuriperinnön opas (2019)
broader: hautarakennelmat
in scheme: tao
definition: pääasiassa maasta kasattu hautarakenne, joka erottuu selvästi ympäröivästä maastosta
type: MAO-käsite
type: Concept

hautarakennelmat
type: MAO-käsite
type: Concept
narrower: hautakummut