MAO-käsite
label: MAO-begrepp @sv
label: MAO Concept @en
type: Class

muurilistat
preferred label: cordon @en
preferred label: murlist @sv
preferred label: Кордон (kordón) @ru
alternative label: heavy cordon @en
alternative label: grov cordon @sv
alternative label: cordonit
alternative label: fine cordon @en
alternative label: fin cordon @sv
in scheme: tao
comment: Suuremmissa linnoituksissa muurit yleensä päättyvät ylhäällä listaan, joita on kahdenlaisia: ”karkea cordon” on paksu ja pyöreäreunainen, ”hieno cordon” on reunaltaan suorasärmäinen.
broader: linnoitteiden osat
type: Concept
type: MAO-käsite

linnoitteiden osat
type: MAO-käsite
type: Concept
narrower: muurilistat