merlonit
type: MAO-käsite
type: Concept
related: rintavarustukset

rintavarustukset
in scheme: tao
alternative label: Brustmaner @de
preferred label: parapet @en
alternative label: rintasuojat
alternative label: bröstvärn @sv
alternative label: парапет (parapét) @en
related: merlonit
related: ampumatasot
preferred label: Brustwehr @de
preferred label: Бруствер (brustvér) @ru
preferred label: bröstmur @sv
preferred label: parapetto @it
type: MAO-käsite
type: Concept
comment: Venäjän ”parapét” on ilmeisesti useimmin rintasuojan erikoistapaus; muurimainen osuus, ei valli.
comment: Matala muuri (rintamuuri) ja sen päällä oleva maavalli tai pelkästään suorasärmäiseksi muotoiltu maavalli, jonka tehtävänä on suojata ampumatason tykkimiehistöä suoralta tulitukselta. Myös ampumahaudan eteen kaivettaessa saadusta maasta luotu matala valli, jonka lähimpänä tarkoituksena on ampujan yläruumiin suojaaminen edestäpäin ammutulta vihollistulelta ja räjähtävien kranaattien sirpaleilta.
broader: varustukset

MAO-käsite
label: MAO-begrepp @sv
label: MAO Concept @en
type: Class

varustukset
type: MAO-käsite
type: Concept
narrower: rintavarustukset

ampumatasot
type: MAO-käsite
type: Concept
related: rintavarustukset