MAO-käsite
label: MAO-begrepp @sv
label: MAO Concept @en
type: Class

redantit
in scheme: tao
preferred label: redan @fr
preferred label: Редан (redán) @ru
comment: Kahden siiven muodostama linnoituslaite. Nuolivarustukseksi (ransk.fleche, ven. стрелка (strélka) kutsutaan yleensä vain pieniä redantteja
type: MAO-käsite
type: Concept
alternative label: redanit
alternative label: nuolivarutukset
alternative label: редант (redánt) @ru
broader: linnoitteiden osat

linnoitteiden osat
type: MAO-käsite
type: Concept
narrower: redantit