bonetit
broader: linnoitteiden osat
comment: 1) Muuririntaman ulostyöntyvässä kulmassa kohtaava osittainen korotusosa, joka suojaa toisinaan varustuksen katettuja sisäosia. 2) Venäläisten lähteiden mukaan bonetti on tulitustasolta n. 0,45 metriä ylöspäin nostettu ampumaraoilla varustettu taso.
preferred label: Бонет (bonét) @ru
preferred label: bonnett @sv
preferred label: bonnet @fr
in scheme: tao
type: MAO-käsite
type: Concept

MAO-käsite
label: MAO-begrepp @sv
label: MAO Concept @en
type: Class

linnoitteiden osat
type: MAO-käsite
type: Concept
narrower: bonetit