kivilatomukset
type: MAO-käsite
type: Concept
narrower: kivikompassit

MAO-käsite
label: MAO-begrepp @sv
label: MAO Concept @en
type: Class

kivikompassit
source: Arkeologisen kulttuuriperinnön opas (2019)
broader: kivilatomukset
in scheme: tao
definition: merensaaristossa kalliolle tai maanpinnalle ilmansuuntien mukaisesti tehty kivilatomus
type: MAO-käsite
type: Concept