pajat (rakennukset)
type: MAO-käsite
type: Concept
narrower: vasarapajat

MAO-käsite
label: MAO-begrepp @sv
label: MAO Concept @en
type: Class

vasarapajat
source: Arkeologisen kulttuuriperinnön opas (2019)
broader: pajat (rakennukset)
in scheme: tao
definition: rakennus, jossa masuunissa tuotettu takkirauta jalostetaan jatkokäsittelyä varten
type: MAO-käsite
type: Concept