MAO-käsite
label: MAO-begrepp @sv
label: MAO Concept @en
type: Class

maakunnallisesti merkittävät rakennetut kulttuuriympäristöt
note: Maakunnallisesti merkittävät rakennetut kulttuuriympäristöt selvitetään ja niistä päätetään maakuntakaavoituksen yhteydessä.
broader: rakennetut kulttuuriympäristöt
in scheme: tao
definition: asiantuntijaviranomaisten määrittelemä maakunnan ominaisluonnetta ja erityispiirteitä ilmentävä rakennettu kulttuuriympäristö
type: MAO-käsite
type: Concept

rakennetut kulttuuriympäristöt
type: MAO-käsite
type: Concept
narrower: maakunnallisesti merkittävät rakennetut kulttuuriympäristöt