vahvistus_2
type: Concept
source: Kielitoimiston sanakirja
comment: antaa jllek toimenpiteelle, päätökselle, määräykselle tms. laillinen, täysi pätevyys, sanktioida; määrätä t. lopullisesti hyväksyä virallisesti noudatettavaksi
alternative label: vahvistus
broader: toisenlaiseksi muuttaminen
in scheme: conceptscheme

toisenlaiseksi muuttaminen
type: Concept
narrower: vahvistus_2