pastoraalit_2
type: Concept
source: Kielitoimiston sanakirja
comment: paimenrunouden aiheista kirjoitettu musiikkia ja balettia sisältävä näytelmä, paimennäytelmä; paimenruno
broader: runot
in scheme: conceptscheme
preferred label: pastoraler @sv
preferred label: pastorals @en

runot
type: Concept
narrower: pastoraalit_2
preferred label: dikter @sv
preferred label: poems @en