kotiseutuneuvokset
type: Concept
broader: honorary titles
in scheme: conceptscheme
preferred label: hembygdsråd @sv
scope note: In singular, 'kotiseutuneuvos', in plural 'kotiseutuneuvokset'.

honorary titles
type: Concept
narrower: kotiseutuneuvokset
preferred label: hederstitlar @sv
preferred label: arvonimet @fi