MIPS
type: Concept
related: ekotehokkuus

ekotehokkuus
type: Concept
scope note: Tarkoittaa tuotannon ja toiminnan tehokkuutta mahdollisimman vähäisin ympäristövaikutuksin
preferred label: ecoefficiency @en
preferred label: ekoeffektivitet @sv
related: MIPS
in scheme: conceptscheme
alternative label: materiaalitehokkuus
alternative label: miljöeffektivitet @sv
alternative label: ympäristötehokkuus
broader: tehokkuus

tehokkuus
type: Concept
preferred label: efficacy @en
preferred label: effektivitet @sv
narrower: ekotehokkuus