inre egenskaper
preferred label: internal qualities @en
preferred label: sisäiset ominaisuudet @fi
type: Concept
narrower: absurditet

absurditet
broader: inre egenskaper
source: Kielitoimiston sanakirja
comment: mieletön, järjetön, järjenvastainen, mahdoton
in scheme: conceptscheme
preferred label: absurd @en
preferred label: absurdi @fi
type: Concept