kotiseutuneuvokset
broader: honorary titles
scope note: In singular, 'kotiseutuneuvos', in plural 'kotiseutuneuvokset'.
in scheme: conceptscheme
preferred label: hembygdsråd @sv
type: Concept

honorary titles
preferred label: hederstitlar @sv
preferred label: arvonimet @fi
type: Concept
narrower: kotiseutuneuvokset