Flexible delivery
type: Concept
narrower: Blended learning
transitive: Blended learning

Blended learning
type: Concept
created: 2007-05-30T00:00:00.000Z
modified: 2007-06-14T00:00:00.000Z
broader: Flexible delivery
transitive: Flexible delivery
change note: 6.0
scope note: Use for resources about the combination of multiple approaches to learning. Typically used for combinations of technology-based materials, face-to-face sessions and print materials.