Flexible delivery
type: Concept
narrower: Distributed learning environment
transitive: Distributed learning environment

Distributed learning environment
type: Concept
created: 2007-05-30T00:00:00.000Z
modified: 2007-06-14T00:00:00.000Z
broader: Flexible delivery
transitive: Flexible delivery
change note: 6.0
related: Distance education
scope note: Use for resources about instructional models that allows instructor, students, and content to be located in different, decentralised locations so that instruction and learning occur independent of time and place.

Distance education
type: Concept
related: Distributed learning environment