Figures of speech
type: Concept
narrower: Apostrophes (Literary devices)
transitive: Apostrophes (Literary devices)

Apostrophes (Literary devices)
type: Concept
contributor: Education-Services-Australia-Ltd
created: 2005-02-01T00:00:00.000Z
has version: 4
modified: 2013-01-13T22:39:58.000Z
alternative label: Apostrophes (Rhetorical device)
broader: Figures of speech
transitive: Figures of speech
scope note: Use for resources about digression from a discourse in rhetoric. For resources about punctuation apostrophes use Apostrophes (Punctuation).