Automatic stabilisers
type: Concept
contributor: Education-Services-Australia-Ltd
created: 2005-02-01T00:00:00.000Z
has version: 3
modified: 2014-02-03T04:04:47.000Z
broader: Public finance
transitive: Macroeconomics
scope note: Use for resources about those elements of the tax and spending regime that automatically tend to stabilise the economy.

Public finance
type: Concept
narrower: Automatic stabilisers
preferred label: Keuangan publik @id
preferred label: 国家財政 @ja
preferred label: 公共财政 @zh

Macroeconomics
type: Concept
transitive: Automatic stabilisers
preferred label: Ekonomi makro @id
preferred label: マクロ経済学 @ja
preferred label: 宏观经济 @zh