Maps (Geographic location)
type: Concept
transitive: Choropleth maps
preferred label: 地图 @zh

Choropleth maps
type: Concept
created: 2005-02-01T00:00:00.000Z
modified: 2009-07-16T00:00:00.000Z
broader: Thematic maps
transitive: Maps (Geographic location)
transitive: Thematic maps
change note: 6.4 - BT Maps removed, BT Thematic maps added.
scope note: Use for resources about maps which show regions or areas which have the same characteristics.

Thematic maps
type: Concept
narrower: Choropleth maps
transitive: Choropleth maps