Music structure
type: Concept
narrower: Coda

Coda
type: Concept
created: 2005-02-01T00:00:00.000Z
modified: 2009-07-17T00:00:00.000Z
broader: Music structure
scope note: Use for resources about the addition to a standard form or design, occurring as the last part of a piece or melody.