Philosophical movements
type: Concept
narrower: New Age
transitive: New Age
preferred label: Gerakan paham filosofi @id
preferred label: 哲学运动 @zh

New Age
type: Concept
created: 2005-02-01T00:00:00.000Z
modified: 2009-07-16T00:00:00.000Z
broader: Philosophical movements
transitive: Philosophical movements
change note: 6.1 - BT Philosophy removed, BT Philosophical schools added.
scope note: Use for resources about the philosophical movement that uses alternative approaches to traditional Western culture, particularly spiritual exploration, holistic medicine, and mysticism.