Stalking
type: Concept
created: 2005-02-01T00:00:00.000Z
modified: 2009-07-16T00:00:00.000Z
broader: Hunting
change note: 5.3 - BT Predator prey relationship removed, BT Hunting added.
scope note: Use for resources about the action of quietly and secretly following an animal.

Hunting
type: Concept
narrower: Stalking
preferred label: 獵捕行為 @zh