vesistöalueet
type: Concept
preferred label: watersystems @en
preferred label: flodområden @sv
related: vesipiirit (hallintoalueet)

vesipiirit (hallintoalueet)
type: Concept
source: Lähde: EnDic2000
comment: Vuosina 1970-86 vesihallinnon alueyksiköiden nimitys. Nykyään EU:n puitedirektiivin mukainen maa- ja vesialue, joka koostuu yhdestä tai useasta läheisestä vesistöalueesta yhdessä niihin yhteydessä olevien pohjavesien ja rannikkovesien kanssa ja joka on määritelty perusyksiköksi vesistöalueiden hoitoa varten
alternative label: vesipiirit
broader: hallinnollinen piiri (hallintoalueet)
in scheme: conceptscheme
preferred label: water districts @en
preferred label: vattendistrikt @sv
related: vesistöalueet
scope note: Vuosina 1970-86 vesihallinnon alueyksiköiden nimitys. 1.9.1986 vesipiireistä tuli vesi- ja ympäristöpiirejä

hallinnollinen piiri (hallintoalueet)
type: Concept
narrower: vesipiirit (hallintoalueet)