tautomerism
type: Concept
broader generic: chemical phenomena
comment: Tautomeria nimitystä käytetään ilmiöstä, jossa kaksi isomeeristä molekyylirakennetta muuttuu toisikseen protonin ja kaksoissidoksen (pii-elektronien) siirtyessä samanaikaisesti.
broader: chemical phenomena
in scheme: conceptscheme
preferred label: tautomeria @fi
preferred label: tautomeri @sv
related: molecules

molecules
type: Concept
preferred label: molekyylit @fi
preferred label: molekyler @sv
related: tautomerism

chemical phenomena
type: Concept
narrower: tautomerism
preferred label: kemialliset ilmiöt @fi
preferred label: kemiska fenomen @sv