Töllinmäki
type: Concept
broader generic: byggnader
comment: F. E. Sillanpään nuoruudenkoti ja esikoisteoksen syntypaikka Hämeenkyrössä
broader: byggnader
in scheme: conceptscheme

byggnader
type: Concept
narrower: Töllinmäki
preferred label: buildings @en
preferred label: rakennukset @fi