toukat
type: Concept
source: Biologian sanakirja
broader generic: eliöt
comment: useiden eläinten aikuisvaihetta edeltävä kehitysvaihe, joka poikkeaa rakenteellisesti ja toiminnallisesti aikuisesta; lisäksi toukka on emoyksilöstä riippumaton ja itsenäinen mutta ei kykene lisääntymään
broader: eliöt
in scheme: conceptscheme
preferred label: larvae @en
preferred label: larver @sv

eliöt
type: Concept
narrower: toukat
preferred label: organismer @sv
preferred label: organisms @en

eliöt elinkierron mukaan
type: Collection
member: toukat