polycykliska kolväten, aromatiska
type: Concept
preferred label: polycyclic hydrocarbons, aromatic @en
preferred label: PAH-yhdisteet @fi
related: kreosot

kreosot
type: Concept
broader generic: träskyddsmedel
comment: Kreosootti on vanhin käytössä oleva puunsuoja-aine, sillä on kyllästetty puuta yli 150 vuotta. Kreosoottia valmistetaan kivihiilitervasta, joka on koksauksen tai kaupunkikaasun sivutuote. Eniten kreosoootilla on kyllästetty puhelin- ja sähköpylväitä sekä ratapölkkyjä. Työtekijöillä, jotka ovat altistuneet merkittävästi kivihiilipielle tai -tervalle, kuten koksaamoiden ja alumiinitehtaiden työntekijöillä, on todettu olevan kohonnut riski sairastua syöpään.
broader: träskyddsmedel
in scheme: conceptscheme
preferred label: creosote @en
preferred label: kreosootti @fi
related: polycykliska kolväten, aromatiska

träskyddsmedel
type: Concept
narrower: kreosot
preferred label: wood preservatives @en
preferred label: puunsuoja-aineet @fi