typensidonta
type: Concept
broader generic: sidonta (kemialliset ilmiöt)
broader: sidonta (kemialliset ilmiöt)
preferred label: kvävefixering @sv
preferred label: nitrogen fixation @en

sidonta (kemialliset ilmiöt)
type: Concept
source: Kielitoimiston sanakirja
broader generic: kemialliset ilmiöt
comment: kappaleesta, aineesta: imeä, pidättää toista ainetta; kem. aineista, atomeista t. atomiryhmistä: muodostaa kemiallinen yhdiste jnk toisen aineen, atomin t. atomiryhmän kanssa
alternative label: sidonta
broader: kemialliset ilmiöt
in scheme: conceptscheme
narrower: typensidonta
preferred label: bindning (kemiska fenomen) @sv
preferred label: bonding (chemistry) @en

kemialliset ilmiöt
type: Concept
narrower: sidonta (kemialliset ilmiöt)
preferred label: kemiska fenomen @sv
preferred label: chemical phenomena @en