lantbruksavfall
type: Concept
source: Ympäristösanasto TSK 27
broader generic: sopor
comment: jäteluokka, johon kuuluu kasvien viljelystä ja eläinten kasvattamisesta peräisin oleva tuotantojäte
broader: sopor
in scheme: conceptscheme
preferred label: farm waste @en
preferred label: maatalousjätteet @fi

sopor
type: Concept
narrower: lantbruksavfall
preferred label: waste @en
preferred label: jätteet @fi