mentala fenomen
type: Concept
narrower: intryck
preferred label: mental phenomena @en
preferred label: mentaaliset ilmiöt @fi

intryck
type: Concept
source: Kielitoimiston sanakirja
broader generic: mentala fenomen
comment: henkiseen toimintaan t. kehitykseen vaikuttava ulkopuolinen virike, esikuva tms., vaikutus
broader: mentala fenomen
in scheme: conceptscheme
preferred label: influences @en
preferred label: vaikutteet @fi
related: effekter

effekter
type: Concept
preferred label: effects @en
preferred label: vaikutukset @fi
related: intryck