mentaaliset ominaisuudet
type: Concept
narrower: itsenäisyys
preferred label: mentala egenskaper @sv
preferred label: mental qualities @en

itsenäisyys
type: Concept
source: Kielitoimiston sanakirja
broader generic: mentaaliset ominaisuudet
comment: itsenäinen: oman päänsä mukaan toimiva, esikuvista, vaikutteista tms. riippumaton, omintakeinen
alternative label: itsenäisyys (vaikutteista)
broader: mentaaliset ominaisuudet
in scheme: conceptscheme
note: YSOhierN YSO termin yläluokka
preferred label: självständighet (mental egenskap) @sv
preferred label: independence @en