gammaltroende (religiösa rörelser)
type: Concept
broader generic: religiösa rörelser
comment: Myös nykyiset Suomen ev.lut. kirkon naispappeuden torjujat kutsuvat joskus itseään vanhauskoisiksi.
broader: religiösa rörelser
in scheme: conceptscheme
preferred label: Old Believers (religious movements) @en
preferred label: vanhauskoiset (uskonnolliset liikkeet) @fi

religiösa rörelser
type: Concept
narrower: gammaltroende (religiösa rörelser)
preferred label: religious movements @en
preferred label: uskonnolliset liikkeet @fi