klippekonomi
type: Concept
source: Kielitoimiston sanakirja
broader generic: ekonomi
comment: riskialttiisiin sijoituksiin perustuva talous; talous joka tarjoaa hyvät mahdollisuudet keinotteluun
alternative label: kasinoekonomi
broader: ekonomi
in scheme: conceptscheme
preferred label: kasinotalous @fi
preferred label: casino economy @en

ekonomi
type: Concept
narrower: klippekonomi
preferred label: economics @en
preferred label: talous @fi