dramaturgy
type: Concept
source: Kielitoimiston sanakirja
broader generic: sciences
comment: draaman estetiikka, näytelmäteoria, näytelmätiede
broader: sciences
in scheme: conceptscheme
preferred label: dramaturgia @fi
preferred label: dramaturgi @sv

sciences
type: Concept
narrower: dramaturgy
preferred label: tieteenalat @fi
preferred label: vetenskaper @sv