kansantalous
type: Concept
source: Kielitoimiston sanakirja
broader generic: talous
comment: maan julkisen talouden ja yksityisten talousyksiköiden toiminta kokonaisuutena; myös kansantaloustieteestä
broader: talous
in scheme: conceptscheme
note: YSOsama Sama termi kuin YSOssa
preferred label: samhällsekonomi @sv
preferred label: national economy @en

talous
type: Concept
narrower: kansantalous
preferred label: economics @en
preferred label: ekonomi @sv