ketjut (konkreettinen eloton objekti)
type: Concept
source: Kielitoimiston sanakirja
broader generic: konkreettinen eloton objekti
comment: toisiinsa liitetyistä renkaista tms. osista koostuva nauhamainen t. köysimäinen taipuisa rakenne
alternative label: ketjut
broader: konkreettinen eloton objekti
in scheme: conceptscheme
preferred label: kedjor (föremål) @sv
preferred label: chains (concrete inanimate object) @en

konkreettinen eloton objekti
type: Concept
narrower: ketjut (konkreettinen eloton objekti)
preferred label: concrete inanimate object @en
preferred label: konkret icke-levande objekt @sv