rebroadcasts
type: Concept
source: Suomen kielen perussanakirja
broader generic: arranged event
comment: 1) uusiminen; 2) uusintaesitys, -kilpailu tms.; 3) uusimisen tulos, uusittu laitos
broader: arranged event
in scheme: conceptscheme
preferred label: repriser @sv
preferred label: uusinnat @fi

arranged event
type: Concept
narrower: rebroadcasts
preferred label: ordnad händelse @sv
preferred label: järjestetty tapahtuma @fi