ammunta (urheilu)
type: Concept
source: Kielitoimiston sanakirja
broader generic: urheilu
comment: saattaa ammus, nuoli tms. (tavallisesti jollakin aseella) nopeaan liikkeeseen (tavallisesti jotakin maalia kohti)
alternative label: ampumaurheilu
alternative label: ammunta
broader: urheilu
in scheme: conceptscheme
narrower: jousiammunta (urheilu)
preferred label: skytte @sv
preferred label: shooting (sport) @en

jousiammunta (urheilu)
type: Concept
broader generic: ammunta (urheilu)
broader: ammunta (urheilu)
preferred label: bågskytte (idrottt) @sv
preferred label: archery @en

urheilu
type: Concept
narrower: ammunta (urheilu)
preferred label: sport @en
preferred label: idrott @sv