tekniskt objekt
type: Concept
narrower: teodoliter
preferred label: technical object @en
preferred label: tekninen objekti @fi

teodoliter
type: Concept
source: Kielitoimiston sanakirja
broader generic: tekniskt objekt
comment: tähtäyskaukoputkellinen koje, jolla mitataan vaakatason kulmia
broader: tekniskt objekt
in scheme: conceptscheme
preferred label: theodolites @en
preferred label: teodoliitit @fi