tuomiokunnat (hallintoelimet)
type: Concept
source: www.finlex.fi
broader generic: hallintoelimet
comment: Tuomiokunta on kihlakunnantuomarin ja käräjätuomareiden virka-alue eli eräänlainen hallinnollinen yksikkö, jolla on oma kanslia. Tuomiokunnan kansliassa työskentelevät tuomiokunnan tuomarit, toimistohenkilökunta ja notaarit. Kansliassa suoritetaan asiakaspalvelua, otetaan vastaan ja annetaan asiakirjoja, suoritetaan pöytäkirjojen kokoonpanotyöt ynnä muuta sellaista.
alternative label: tuomiokunnat
broader: hallintoelimet
in scheme: conceptscheme
preferred label: judicial districts @en
preferred label: domsagor (förvaltningsorgan) @sv

hallintoelimet
type: Concept
narrower: tuomiokunnat (hallintoelimet)
preferred label: administrativa organ @sv
preferred label: administrative bodies @en